Reaction Details
TargetC-X-C chemokine receptor type 2
LigandBDBM50065331
Substrate/Competitorn/a
Meas. Tech.ChEMBL_1465563 (CHEMBL3404716)
IC50 5.0±n/a nM
Citation Austin, RPBennion, CBonnert, RVCheema, LCook, ARCox, RJEbden, MRGaw, AGrime, KMeghani, PNicholls, DPhillips, CSmith, NSteele, JStonehouse, JP Discovery and evaluation of a novel monocyclic series of CXCR2 antagonists. Bioorg Med Chem Lett25:1616-20 (2015) 
 
C-X-C chemokine receptor type 2
Name:C-X-C chemokine receptor type 2
Type:Protein
Mol. Mass.:40767.88
Organism:Homo sapiens (Human)
Description:P25025
Residue:360
BDBM50065331
NameBDBM50065331
Synonyms:CHEMBL3403855
TypeSmall organic molecule
Emp. Form.C18H23ClFN5O4S2
Mol. Mass.491.988
SMILESC[C@H](CO)Nc1cc(NS(=O)(=O)N2CCOCC2)nc(SCc2cccc(Cl)c2F)n1