Reaction Details
TargetRenin
LigandBDBM50066269
Substrate/Competitorn/a
Meas. Tech.ChEMBL_1465616 (CHEMBL3404918)
IC50 3.0±n/a nM
Citation Lorthiois, ECumin, FEhrhardt, CKosaka, TSellner, HOstermann, NFrancotte, EWagner, TMaibaum, J trans-(3S,4S)-Disubstituted pyrrolidines as inhibitors of the human aspartyl protease renin. Part I: prime site exploration using an amino linker. Bioorg Med Chem Lett25:1782-6 (2015) 
 
Renin
Name:Renin
Type:Enzyme
Mol. Mass.:45058.99
Organism:Homo sapiens (Human)
Description:n/a
Residue:406
BDBM50066269
NameBDBM50066269
Synonyms:CHEMBL3401541
TypeSmall organic molecule
Emp. Form.C27H39N3O6S
Mol. Mass.533.68
SMILESCOCCCOc1cc(ccc1OC)C(=O)N(C[C@@H]1CNC[C@H]1NS(=O)(=O)Cc1ccccc1)C(C)C