Reaction Details
TargetDual specificity protein kinase TTK
LigandBDBM50072900
Substrate/Competitorn/a
Meas. Tech.ChEMBL_1467137 (CHEMBL3411334)
IC50 1.3±n/a nM
Citation Kusakabe, KIde, NDaigo, YItoh, TYamamoto, THashizume, HNozu, KYoshida, HTadano, GTagashira, SHigashino, KOkano, YSato, YInoue, MIguchi, MKanazawa, TIshioka, YDohi, KKido, YSakamoto, SAndo, SMaeda, MHigaki, MBaba, YNakamura, Y Discovery of imidazo[1,2-b]pyridazine derivatives: selective and orally available Mps1 (TTK) kinase inhibitors exhibiting remarkable antiproliferative activity. J Med Chem58:1760-75 (2015) 
 
Dual specificity protein kinase TTK
Name:Dual specificity protein kinase TTK
Type:Protein
Mol. Mass.:97086.79
Organism:Homo sapiens (Human)
Description:P33981
Residue:857
BDBM50072900
NameBDBM50072900
Synonyms:CHEMBL3410073
TypeSmall organic molecule
Emp. Form.C29H29N7O2
Mol. Mass.507.5863
SMILESNc1cc(ccc1-c1cc(NCC2CCOCC2)c2ncc(-c3ccc(cc3)C(=O)NC3CC3)n2n1)C#N