Reaction Details
TargetIntegrase
LigandBDBM50075215
Substrate/Competitorn/a
Meas. Tech.ChEMBL_1473740 (CHEMBL3418257)
IC50 36000±n/a nM
Citation Vernekar, SKLiu, ZNagy, EMiller, LKirby, KAWilson, DJKankanala, JSarafianos, SGParniak, MAWang, Z Design, synthesis, biochemical, and antiviral evaluations of C6 benzyl and C6 biarylmethyl substituted 2-hydroxylisoquinoline-1,3-diones: dual inhibition against HIV reverse transcriptase-associated RNase H and polymerase with antiviral activities. J Med Chem58:651-64 (2015) 
 
Integrase
Name:Integrase
Synonyms:pol
Type:PROTEIN
Mol. Mass.:32203.43
Organism:Human immunodeficiency virus 1
Description:ChEMBL_106649
Residue:288
BDBM50075215
NameBDBM50075215
Synonyms:CHEMBL3414858
TypeSmall organic molecule
Emp. Form.C17H15NO3
Mol. Mass.281.3059
SMILESCc1ccc(Cc2ccc3C(=O)N(O)C(=O)Cc3c2)cc1