Reaction Details
TargetReverse transcriptase/RNaseH
LigandBDBM50075221
Substrate/Competitorn/a
Meas. Tech.ChEMBL_1473730 (CHEMBL3418036)
IC50 700±n/a nM
Citation Vernekar, SKLiu, ZNagy, EMiller, LKirby, KAWilson, DJKankanala, JSarafianos, SGParniak, MAWang, Z Design, synthesis, biochemical, and antiviral evaluations of C6 benzyl and C6 biarylmethyl substituted 2-hydroxylisoquinoline-1,3-diones: dual inhibition against HIV reverse transcriptase-associated RNase H and polymerase with antiviral activities. J Med Chem58:651-64 (2015) 
 
Reverse transcriptase/RNaseH
Name:Reverse transcriptase/RNaseH
Type:PROTEIN
Mol. Mass.:65229.15
Organism:Human immunodeficiency virus 1
Description:ChEMBL_1473730
Residue:566
BDBM50075221
NameBDBM50075221
Synonyms:CHEMBL3414873
TypeSmall organic molecule
Emp. Form.C22H15F2NO3
Mol. Mass.379.3562
SMILESON1C(=O)Cc2cc(Cc3ccc(cc3)-c3ccc(F)cc3F)ccc2C1=O