Reaction Details
TargetReverse transcriptase
LigandBDBM50075211
Substrate/Competitorn/a
Meas. Tech.ChEMBL_1473731 (CHEMBL3418037)
IC50 1700±n/a nM
Citation Vernekar, SKLiu, ZNagy, EMiller, LKirby, KAWilson, DJKankanala, JSarafianos, SGParniak, MAWang, Z Design, synthesis, biochemical, and antiviral evaluations of C6 benzyl and C6 biarylmethyl substituted 2-hydroxylisoquinoline-1,3-diones: dual inhibition against HIV reverse transcriptase-associated RNase H and polymerase with antiviral activities. J Med Chem58:651-64 (2015) 
 
Reverse transcriptase
Name:Reverse transcriptase
Synonyms:n/a
Type:Protein
Mol. Mass.:29598.37
Organism:Human immunodeficiency virus 1
Description:Q9WKE8
Residue:254
BDBM50075211
NameBDBM50075211
Synonyms:CHEMBL3414857
TypeSmall organic molecule
Emp. Form.C16H13NO3
Mol. Mass.267.2793
SMILESON1C(=O)Cc2cc(Cc3ccccc3)ccc2C1=O