Reaction Details
TargetP2X purinoceptor 7
LigandBDBM50075456
Substrate/Competitorn/a
Meas. Tech.ChEMBL_1473818 (CHEMBL3418717)
IC50 99±n/a nM
Citation Park, JHLee, GELee, SDHien, TTKim, SYang, JWCho, JHKo, HLim, SCKim, YGKang, KWKim, YC Discovery of novel 2,5-dioxoimidazolidine-based P2X(7) receptor antagonists as constrained analogues of KN62. J Med Chem58:2114-34 (2015) 
 
P2X purinoceptor 7
Name:P2X purinoceptor 7
Type:Protein
Mol. Mass.:68602.85
Organism:Homo sapiens (Human)
Description:Q99572
Residue:595
BDBM50075456
NameBDBM50075456
Synonyms:CHEMBL3415332
TypeSmall organic molecule
Emp. Form.C37H42N4O6S
Mol. Mass.670.818
SMILESCC12CC3CC(C)(C1)CC(C3)(C2)C(=O)N1CCC(CC1)N1C(Cc2ccc(OS(=O)(=O)c3cccc4cnccc34)cc2)C(=O)NC1=O