Reaction Details
TargetP2X purinoceptor 7
LigandBDBM50075462
Substrate/Competitorn/a
Meas. Tech.ChEMBL_1473820 (CHEMBL3418719)
IC50 192±n/a nM
Citation Park, JHLee, GELee, SDHien, TTKim, SYang, JWCho, JHKo, HLim, SCKim, YGKang, KWKim, YC Discovery of novel 2,5-dioxoimidazolidine-based P2X(7) receptor antagonists as constrained analogues of KN62. J Med Chem58:2114-34 (2015) 
 
P2X purinoceptor 7
Name:P2X purinoceptor 7
Type:Protein
Mol. Mass.:68602.85
Organism:Homo sapiens (Human)
Description:Q99572
Residue:595
BDBM50075462
NameBDBM50075462
Synonyms:CHEMBL3415338
TypeSmall organic molecule
Emp. Form.C31H27ClN4O6S
Mol. Mass.619.087
SMILESClc1ccc(cc1)C(=O)N1CCC(CC1)N1C(Cc2ccc(OS(=O)(=O)c3cccc4cnccc34)cc2)C(=O)NC1=O