Reaction Details
TargetIntegrase
LigandBDBM25351
Substrate/Competitorn/a
Meas. Tech.ChEMBL_1473839 (CHEMBL3418916)
IC50 7.0±n/a nM
Citation Cuzzucoli Crucitti, GMétifiot, MPescatori, LMessore, AMadia, VNPupo, GSaccoliti, FScipione, LTortorella, SEsposito, FCorona, ACadeddu, MMarchand, CPommier, YTramontano, ECosti, RDi Santo, R Structure-activity relationship of pyrrolyl diketo acid derivatives as dual inhibitors of HIV-1 integrase and reverse transcriptase ribonuclease H domain. J Med Chem58:1915-28 (2015) 
 
Integrase
Name:Integrase
Synonyms:pol
Type:PROTEIN
Mol. Mass.:32203.43
Organism:Human immunodeficiency virus 1
Description:ChEMBL_106649
Residue:288
BDBM25351
NameBDBM25351
TypeSmall organic molecule
Emp. Form.C20H21FN6O5
Mol. Mass.444.4163
SMILESCc1nnc(o1)C(=O)NC(C)(C)c1nc(C(=O)NCc2ccc(F)cc2)c(O)c(=O)n1C