Reaction Details
TargetApoptosis regulator BAX
LigandBDBM50078022
Substrate/Competitorn/a
Meas. Tech.ChEMBL_1471766 (CHEMBL3417877)
Ki 800±n/a nM
Citation Stornaiuolo, MLa Regina, GPassacantilli, SGrassia, GColuccia, ALa Pietra, VGiustiniano, MCassese, HDi Maro, SBrancaccio, DTaliani, SIalenti, ASilvestri, RMartini, CNovellino, EMarinelli, L Structure-based lead optimization and biological evaluation of BAX direct activators as novel potential anticancer agents. J Med Chem58:2135-48 (2015) 
 
Apoptosis regulator BAX
Name:Apoptosis regulator BAX
Type:PROTEIN
Mol. Mass.:21181.15
Organism:Homo sapiens (Human)
Description:ChEMBL_100916
Residue:192
BDBM50078022
NameBDBM50078022
Synonyms:CHEMBL3417402
TypeSmall organic molecule
Emp. Form.C26H27N5O3
Mol. Mass.457.5243
SMILESCCOc1ccccc1N\N=C1\C(C)=NN(C1=O)c1cc(O)cc(c1)-c1ccc(cc1)N(C)C