Reaction Details
TargetApoptosis regulator BAX
LigandBDBM50078027
Substrate/Competitorn/a
Meas. Tech.ChEMBL_1471766 (CHEMBL3417877)
Ki 1200±n/a nM
Citation Stornaiuolo, MLa Regina, GPassacantilli, SGrassia, GColuccia, ALa Pietra, VGiustiniano, MCassese, HDi Maro, SBrancaccio, DTaliani, SIalenti, ASilvestri, RMartini, CNovellino, EMarinelli, L Structure-based lead optimization and biological evaluation of BAX direct activators as novel potential anticancer agents. J Med Chem58:2135-48 (2015) 
 
Apoptosis regulator BAX
Name:Apoptosis regulator BAX
Type:PROTEIN
Mol. Mass.:21181.15
Organism:Homo sapiens (Human)
Description:ChEMBL_100916
Residue:192
BDBM50078027
NameBDBM50078027
Synonyms:CHEMBL3417407
TypeSmall organic molecule
Emp. Form.C27H28N4O3
Mol. Mass.456.5362
SMILESCCOc1ccccc1N\N=C1\C(C)=NN(C1=O)c1cc(O)cc(c1)-c1ccc(cc1)C(C)C