Reaction Details
TargetBcl-2-like protein 1
LigandBDBM50078029
Substrate/Competitorn/a
Meas. Tech.ChEMBL_1471768 (CHEMBL3417879)
Ki 3400±n/a nM
Citation Stornaiuolo, MLa Regina, GPassacantilli, SGrassia, GColuccia, ALa Pietra, VGiustiniano, MCassese, HDi Maro, SBrancaccio, DTaliani, SIalenti, ASilvestri, RMartini, CNovellino, EMarinelli, L Structure-based lead optimization and biological evaluation of BAX direct activators as novel potential anticancer agents. J Med Chem58:2135-48 (2015) 
 
Bcl-2-like protein 1
Name:Bcl-2-like protein 1
Type:Mitochondrion membrane; Single-pass membrane protein
Mol. Mass.:26039.60
Organism:Homo sapiens (Human)
Description:n/a
Residue:233
BDBM50078029
NameBDBM50078029
Synonyms:CHEMBL3417409
TypeSmall organic molecule
Emp. Form.C28H25N5O2
Mol. Mass.463.5304
SMILESCN(C)c1ccc(cc1)-c1cc(O)cc(c1)N1N=C(C)\C(=N\Nc2ccc3ccccc3c2)C1=O