Reaction Details
TargetBcl-2-like protein 1
LigandBDBM50078018
Substrate/Competitorn/a
Meas. Tech.ChEMBL_1471768 (CHEMBL3417879)
Ki 3400±n/a nM
Citation Stornaiuolo, MLa Regina, GPassacantilli, SGrassia, GColuccia, ALa Pietra, VGiustiniano, MCassese, HDi Maro, SBrancaccio, DTaliani, SIalenti, ASilvestri, RMartini, CNovellino, EMarinelli, L Structure-based lead optimization and biological evaluation of BAX direct activators as novel potential anticancer agents. J Med Chem58:2135-48 (2015) 
 
Bcl-2-like protein 1
Name:Bcl-2-like protein 1
Type:Mitochondrion membrane; Single-pass membrane protein
Mol. Mass.:26039.60
Organism:Homo sapiens (Human)
Description:n/a
Residue:233
BDBM50078018
NameBDBM50078018
Synonyms:CHEMBL3417398
TypeSmall organic molecule
Emp. Form.C24H17N3OS
Mol. Mass.395.476
SMILESCC1=NN(C(=O)\C1=C\c1ccc2ccccc2c1)c1nc(cs1)-c1ccccc1