Reaction Details
TargetBcl-2-like protein 1
LigandBDBM50078016
Substrate/Competitorn/a
Meas. Tech.ChEMBL_1471768 (CHEMBL3417879)
Ki>100000±n/a nM
Citation Stornaiuolo, MLa Regina, GPassacantilli, SGrassia, GColuccia, ALa Pietra, VGiustiniano, MCassese, HDi Maro, SBrancaccio, DTaliani, SIalenti, ASilvestri, RMartini, CNovellino, EMarinelli, L Structure-based lead optimization and biological evaluation of BAX direct activators as novel potential anticancer agents. J Med Chem58:2135-48 (2015) 
 
Bcl-2-like protein 1
Name:Bcl-2-like protein 1
Type:Mitochondrion membrane; Single-pass membrane protein
Mol. Mass.:26039.60
Organism:Homo sapiens (Human)
Description:n/a
Residue:233
BDBM50078016
NameBDBM50078016
Synonyms:CHEMBL3417396
TypeSmall organic molecule
Emp. Form.C27H21N3OS
Mol. Mass.435.54
SMILESCC1=NN(C(=O)\C1=C\C(c1ccccc1)c1ccccc1)c1nc(cs1)-c1ccccc1