Reaction Details
TargetApoptosis regulator Bcl-2
LigandBDBM50078030
Substrate/Competitorn/a
Meas. Tech.ChEMBL_1471767 (CHEMBL3417878)
Ki 1900±n/a nM
Citation Stornaiuolo, MLa Regina, GPassacantilli, SGrassia, GColuccia, ALa Pietra, VGiustiniano, MCassese, HDi Maro, SBrancaccio, DTaliani, SIalenti, ASilvestri, RMartini, CNovellino, EMarinelli, L Structure-based lead optimization and biological evaluation of BAX direct activators as novel potential anticancer agents. J Med Chem58:2135-48 (2015) 
 
Apoptosis regulator Bcl-2
Name:Apoptosis regulator Bcl-2
Type:Homodimer or heterodimer
Mol. Mass.:26269.11
Organism:Homo sapiens (Human)
Description:P10415
Residue:239
BDBM50078030
NameBDBM50078030
Synonyms:CHEMBL3417410
TypeSmall organic molecule
Emp. Form.C20H15N3OS
Mol. Mass.345.418
SMILESCC1=NN(C(=O)\C1=C\c1ccccc1)c1nc(cs1)-c1ccccc1