Reaction Details
TargetBeta-secretase 1
LigandBDBM50078353
Substrate/Competitorn/a
Meas. Tech.ChEMBL_1470595 (CHEMBL3420008)
IC50 36000±n/a nM
Citation Butler, CRBrodney, MABeck, EMBarreiro, GNolan, CEPan, FVajdos, FParris, KVarghese, AHHelal, CJLira, RDoran, SDRiddell, DRBuzon, LMDutra, JKMartinez-Alsina, LAOgilvie, KMurray, JCYoung, JMAtchison, KRobshaw, AGonzales, CWang, JZhang, YO'Neill, BT Discovery of a series of efficient, centrally efficacious BACE1 inhibitors through structure-based drug design. J Med Chem58:2678-702 (2015) 
 
Beta-secretase 1
Name:Beta-secretase 1
Type:Protein
Mol. Mass.:55755.10
Organism:Homo sapiens (Human)
Description:P56817
Residue:501
BDBM50078353
NameBDBM50078353
Synonyms:CHEMBL3414702
TypeSmall organic molecule
Emp. Form.C11H12F2N2S
Mol. Mass.242.288
SMILESC[C@]1(CCSC(N)=N1)c1ccc(F)cc1F