Reaction Details
TargetHepatocyte growth factor receptor
LigandBDBM24469
Substrate/Competitorn/a
Meas. Tech.ChEMBL_1470881 (CHEMBL3418289)
IC50 2100±n/a nM
Citation Peterson, EATeffera, YAlbrecht, BKBauer, DBellon, SFBoezio, ABoezio, CBroome, MAChoquette, DCopeland, KWDussault, ILewis, RLin, MHLohman, JLiu, JPotashman, MRex, KShimanovich, RWhittington, DAVaida, KRHarmange, JC Discovery of potent and selective 8-fluorotriazolopyridine c-Met inhibitors. J Med Chem58:2417-30 (2015) 
 
Hepatocyte growth factor receptor
Name:Hepatocyte growth factor receptor
Type:Protein
Mol. Mass.:155559.73
Organism:Homo sapiens (Human)
Description:P08581
Residue:1390
BDBM24469
NameBDBM24469
Synonyms:4-({6-phenyl-[1,2,4]triazolo[3,4-a]pyridin-3-yl}methyl)phenol Triazolopyridine, 3c | US9066954, 66
TypeSmall organic molecule
Emp. Form.C19H15N3O
Mol. Mass.301.3419
SMILESOc1ccc(Cc2nnc3ccc(cn23)-c2ccccc2)cc1