Reaction Details
TargetMAP kinase-interacting serine/threonine-protein kinase 2
LigandBDBM50079404
Substrate/Competitorn/a
Meas. Tech.ChEMBL_1470961 (CHEMBL3419829)
Ki>10000±n/a nM
Citation Yu, MLi, PBasnet, SKKumarasiri, MDiab, STeo, TAlbrecht, HWang, S Discovery of 4-(dihydropyridinon-3-yl)amino-5-methylthieno[2,3-d]pyrimidine derivatives as potent Mnk inhibitors: synthesis, structure-activity relationship analysis and biological evaluation. Eur J Med Chem95:116-26 (2015) 
 
MAP kinase-interacting serine/threonine-protein kinase 2
Name:MAP kinase-interacting serine/threonine-protein kinase 2
Type:Protein
Mol. Mass.:51870.79
Organism:Homo sapiens (Human)
Description:Q9HBH9
Residue:465
BDBM50079404
NameBDBM50079404
Synonyms:CHEMBL3417206
TypeSmall organic molecule
Emp. Form.C15H14N4O3S
Mol. Mass.330.362
SMILESCOC(=O)c1sc2ncnc(Nc3ccc(=O)n(C)c3)c2c1C