Reaction Details
TargetMAP kinase-interacting serine/threonine-protein kinase 1
LigandBDBM50079469
Substrate/Competitorn/a
Meas. Tech.ChEMBL_1470960 (CHEMBL3419828)
Ki>10000±n/a nM
Citation Yu, MLi, PBasnet, SKKumarasiri, MDiab, STeo, TAlbrecht, HWang, S Discovery of 4-(dihydropyridinon-3-yl)amino-5-methylthieno[2,3-d]pyrimidine derivatives as potent Mnk inhibitors: synthesis, structure-activity relationship analysis and biological evaluation. Eur J Med Chem95:116-26 (2015) 
 
MAP kinase-interacting serine/threonine-protein kinase 1
Name:MAP kinase-interacting serine/threonine-protein kinase 1
Type:Serine/threonine-protein kinase
Mol. Mass.:51342.85
Organism:Homo sapiens (Human)
Description:Q9BUB5
Residue:465
BDBM50079469
NameBDBM50079469
Synonyms:CHEMBL3417200
TypeSmall organic molecule
Emp. Form.C15H15N5O2S
Mol. Mass.329.377
SMILESCc1c(sc2ncnc(Nc3cc(C)cn(C)c3=O)c12)C(N)=O