Reaction Details
TargetHepatocyte growth factor receptor
LigandBDBM50079559
Substrate/Competitorn/a
Meas. Tech.ChEMBL_1471545 (CHEMBL3420280)
IC50 10.0±n/a nM
Citation Xing, WAi, JJin, SShi, ZPeng, XWang, LJi, YLu, DLiu, YGeng, MHu, Y Enhancing the cellular anti-proliferation activity of pyridazinones as c-met inhibitors using docking analysis. Eur J Med Chem95:302-12 (2015) 
 
Hepatocyte growth factor receptor
Name:Hepatocyte growth factor receptor
Type:Protein
Mol. Mass.:155559.73
Organism:Homo sapiens (Human)
Description:P08581
Residue:1390
BDBM50079559
NameBDBM50079559
Synonyms:CHEMBL3417483
TypeSmall organic molecule
Emp. Form.C30H35FN6O3
Mol. Mass.546.6357
SMILESCN1CCN(CCCCCOC(=O)Nc2cccc(Cn3nc(ccc3=O)-n3ccc4ccc(F)cc34)c2)CC1