Reaction Details
TargetHepatocyte growth factor receptor
LigandBDBM50079562
Substrate/Competitorn/a
Meas. Tech.ChEMBL_1471545 (CHEMBL3420280)
IC50 9.8±n/a nM
Citation Xing, WAi, JJin, SShi, ZPeng, XWang, LJi, YLu, DLiu, YGeng, MHu, Y Enhancing the cellular anti-proliferation activity of pyridazinones as c-met inhibitors using docking analysis. Eur J Med Chem95:302-12 (2015) 
 
Hepatocyte growth factor receptor
Name:Hepatocyte growth factor receptor
Type:Protein
Mol. Mass.:155559.73
Organism:Homo sapiens (Human)
Description:P08581
Residue:1390
BDBM50079562
NameBDBM50079562
Synonyms:CHEMBL3417486
TypeSmall organic molecule
Emp. Form.C31H32FN7O2
Mol. Mass.553.6299
SMILESCN1CCN(CCCOc2cnc(nc2)-c2cccc(Cn3nc(ccc3=O)-n3ccc4ccc(F)cc34)c2)CC1