Reaction Details
TargetHepatocyte growth factor receptor
LigandBDBM50079565
Substrate/Competitorn/a
Meas. Tech.ChEMBL_1471545 (CHEMBL3420280)
IC50 4.2±n/a nM
Citation Xing, WAi, JJin, SShi, ZPeng, XWang, LJi, YLu, DLiu, YGeng, MHu, Y Enhancing the cellular anti-proliferation activity of pyridazinones as c-met inhibitors using docking analysis. Eur J Med Chem95:302-12 (2015) 
 
Hepatocyte growth factor receptor
Name:Hepatocyte growth factor receptor
Type:Protein
Mol. Mass.:155559.73
Organism:Homo sapiens (Human)
Description:P08581
Residue:1390
BDBM50079565
NameBDBM50079565
Synonyms:CHEMBL3417489
TypeSmall organic molecule
Emp. Form.C30H30FN5O4
Mol. Mass.543.5887
SMILESFc1ccc2ccn(-c3ccc(=O)n(CCOc4ccnc5cc(OCCCN6CCOCC6)ccc45)n3)c2c1