Reaction Details
TargetHepatocyte growth factor receptor
LigandBDBM50079569
Substrate/Competitorn/a
Meas. Tech.ChEMBL_1471545 (CHEMBL3420280)
IC50 85±n/a nM
Citation Xing, WAi, JJin, SShi, ZPeng, XWang, LJi, YLu, DLiu, YGeng, MHu, Y Enhancing the cellular anti-proliferation activity of pyridazinones as c-met inhibitors using docking analysis. Eur J Med Chem95:302-12 (2015) 
 
Hepatocyte growth factor receptor
Name:Hepatocyte growth factor receptor
Type:Protein
Mol. Mass.:155559.73
Organism:Homo sapiens (Human)
Description:P08581
Residue:1390
BDBM50079569
NameBDBM50079569
Synonyms:CHEMBL3417493
TypeSmall organic molecule
Emp. Form.C27H28F3N5O3
Mol. Mass.527.5381
SMILESCN(C)CCCCOC(=O)Nc1cccc(Cn2nc(ccc2=O)-n2ccc3ccc(cc23)C(F)(F)F)c1