Reaction Details
TargetPotassium voltage-gated channel subfamily H member 2
LigandBDBM50082388
Substrate/Competitorn/a
Meas. Tech.ChEMBL_1475692 (CHEMBL3424851)
IC50 1.7±n/a nM
Citation Singh, SBKaelin, DEWu, JMiesel, LTan, CMMeinke, PTOlsen, DBLagrutta, AWei, CPeng, XWang, XFukuda, HKishii, RTakei, MShibata, TOhata, KTakano, HKurasaki, HTakeuchi, TNishimura, AFukuda, Y Structure activity relationship of substituted 1,5-naphthyridine analogs of oxabicyclooctane-linked novel bacterial topoisomerase inhibitors as broad-spectrum antibacterial agents (Part-4). Bioorg Med Chem Lett25:2409-15 (2015) 
 
Potassium voltage-gated channel subfamily H member 2
Name:Potassium voltage-gated channel subfamily H member 2
Type:Multi-pass membrane protein
Mol. Mass.:126672.65
Organism:Homo sapiens (Human)
Description:Q12809
Residue:1159
BDBM50082388
NameBDBM50082388
Synonyms:CHEMBL3422962
TypeSmall organic molecule
Emp. Form.C27H25N7O3
Mol. Mass.495.5325
SMILESO=C1COc2ccc(CNC34CCC(CCc5c(cnc6ccc(nc56)C#N)C#N)(CC3)OC4)nc2N1