Reaction Details
TargetPotassium voltage-gated channel subfamily H member 2
LigandBDBM50082390
Substrate/Competitorn/a
Meas. Tech.ChEMBL_1475692 (CHEMBL3424851)
IC50 1.4±n/a nM
Citation Singh, SBKaelin, DEWu, JMiesel, LTan, CMMeinke, PTOlsen, DBLagrutta, AWei, CPeng, XWang, XFukuda, HKishii, RTakei, MShibata, TOhata, KTakano, HKurasaki, HTakeuchi, TNishimura, AFukuda, Y Structure activity relationship of substituted 1,5-naphthyridine analogs of oxabicyclooctane-linked novel bacterial topoisomerase inhibitors as broad-spectrum antibacterial agents (Part-4). Bioorg Med Chem Lett25:2409-15 (2015) 
 
Potassium voltage-gated channel subfamily H member 2
Name:Potassium voltage-gated channel subfamily H member 2
Type:Multi-pass membrane protein
Mol. Mass.:126672.65
Organism:Homo sapiens (Human)
Description:Q12809
Residue:1159
BDBM50082390
NameBDBM50082390
Synonyms:CHEMBL3422964
TypeSmall organic molecule
Emp. Form.C27H31N5O5
Mol. Mass.505.5655
SMILESCOc1cc2nccc(CCC34CCC(CC3)(CO4)NCc3ccc4OCC(=O)Nc4n3)c2nc1OC