Reaction Details
TargetPancreatic triacylglycerol lipase
LigandBDBM24567
Substrate/Competitorn/a
Meas. Tech.ChEMBL_1474109 (CHEMBL3424042)
IC50 300±n/a nM
Citation Jeong, JYJo, YHKim, SBLiu, QLee, JWMo, EJLee, KYHwang, BYLee, MK Pancreatic lipase inhibitory constituents from Morus alba leaves and optimization for extraction conditions. Bioorg Med Chem Lett25:2269-74 (2015) 
 
Pancreatic triacylglycerol lipase
Name:Pancreatic triacylglycerol lipase
Type:Enzyme
Mol. Mass.:50080.69
Organism:Sus scrofa (Pig)
Description:P00591
Residue:450
BDBM24567
NameBDBM24567
Synonyms:(2S)-1-[(2S,3S)-3-hexyl-4-oxooxetan-2-yl]tridecan-2-yl (2S)-2-formamido-4-methylpentanoate Orlistat Tetrahydrolipstatin Xenical
TypeSmall organic molecule
Emp. Form.C29H53NO5
Mol. Mass.495.7348
SMILESCCCCCCCCCCC[C@@H](C[C@@H]1OC(=O)[C@H]1CCCCCC)OC(=O)[C@H](CC(C)C)NC=O