Reaction Details
TargetPancreatic triacylglycerol lipase
LigandBDBM50242015
Substrate/Competitorn/a
Meas. Tech.ChEMBL_1474109 (CHEMBL3424042)
IC50 18600±n/a nM
Citation Jeong, JYJo, YHKim, SBLiu, QLee, JWMo, EJLee, KYHwang, BYLee, MK Pancreatic lipase inhibitory constituents from Morus alba leaves and optimization for extraction conditions. Bioorg Med Chem Lett25:2269-74 (2015) 
 
Pancreatic triacylglycerol lipase
Name:Pancreatic triacylglycerol lipase
Type:Enzyme
Mol. Mass.:50080.69
Organism:Sus scrofa (Pig)
Description:P00591
Residue:450
BDBM50242015
NameBDBM50242015
Synonyms:CHEMBL518543 kuwanon C
TypeSmall organic molecule
Emp. Form.C25H26O6
Mol. Mass.422.4703
SMILES[#6]\[#6](-[#6])=[#6]\[#6]-c1c(-[#8])cc(-[#8])c2c1oc(-c1ccc(-[#8])cc1-[#8])c(-[#6]\[#6]=[#6](\[#6])-[#6])c2=O