Reaction Details
TargetPancreatic triacylglycerol lipase
LigandBDBM50251014
Substrate/Competitorn/a
Meas. Tech.ChEMBL_1474109 (CHEMBL3424042)
IC50 29700±n/a nM
Citation Jeong, JYJo, YHKim, SBLiu, QLee, JWMo, EJLee, KYHwang, BYLee, MK Pancreatic lipase inhibitory constituents from Morus alba leaves and optimization for extraction conditions. Bioorg Med Chem Lett25:2269-74 (2015) 
 
Pancreatic triacylglycerol lipase
Name:Pancreatic triacylglycerol lipase
Type:Enzyme
Mol. Mass.:50080.69
Organism:Sus scrofa (Pig)
Description:P00591
Residue:450
BDBM50251014
NameBDBM50251014
Synonyms:CHEMBL465881 | moracin N
TypeSmall organic molecule
Emp. Form.C19H18O4
Mol. Mass.310.3438
SMILES[#6]\[#6](-[#6])=[#6]\[#6]-c1cc2cc(oc2cc1-[#8])-c1cc(-[#8])cc(-[#8])c1