Reaction Details
TargetTyrosine-protein kinase ITK/TSK
LigandBDBM50086604
Substrate/Competitorn/a
Meas. Tech.ChEMBL_1477113 (CHEMBL3428280)
Ki 0.200000±n/a nM
Citation Burch, JDBarrett, KChen, YDeVoss, JEigenbrot, CGoldsmith, RIsmaili, MHLau, KLin, ZOrtwine, DFZarrin, AAMcEwan, PABarker, JJEllebrandt, CKordt, DStein, DBWang, XChen, YHu, BXu, XYuen, PWZhang, YPei, Z Tetrahydroindazoles as Interleukin-2 Inducible T-Cell Kinase Inhibitors. Part II. Second-Generation Analogues with Enhanced Potency, Selectivity, and Pharmacodynamic Modulation in Vivo. J Med Chem58:3806-16 (2015) 
 
Tyrosine-protein kinase ITK/TSK
Name:Tyrosine-protein kinase ITK/TSK
Type:Protein
Mol. Mass.:71839.20
Organism:Homo sapiens (Human)
Description:Q08881
Residue:620
BDBM50086604
NameBDBM50086604
Synonyms:CHEMBL3426308
TypeSmall organic molecule
Emp. Form.C25H29N5O3S
Mol. Mass.479.594
SMILES[H][C@@]12C[C@]1(C)Cc1[nH]nc(C(=O)Nc3cnn(c3)[C@@H](C3CCS(=O)(=O)CC3)c3ccccc3)c1C2