Reaction Details
TargetTyrosine-protein kinase Lck
LigandBDBM50086676
Substrate/Competitorn/a
Meas. Tech.ChEMBL_1477116 (CHEMBL3428283)
Ki 600±n/a nM
Citation Burch, JDBarrett, KChen, YDeVoss, JEigenbrot, CGoldsmith, RIsmaili, MHLau, KLin, ZOrtwine, DFZarrin, AAMcEwan, PABarker, JJEllebrandt, CKordt, DStein, DBWang, XChen, YHu, BXu, XYuen, PWZhang, YPei, Z Tetrahydroindazoles as Interleukin-2 Inducible T-Cell Kinase Inhibitors. Part II. Second-Generation Analogues with Enhanced Potency, Selectivity, and Pharmacodynamic Modulation in Vivo. J Med Chem58:3806-16 (2015) 
 
Tyrosine-protein kinase Lck
Name:Tyrosine-protein kinase Lck
Type:n/a
Mol. Mass.:57987.83
Organism:Homo sapiens (Human)
Description:P06239
Residue:509
BDBM50086676
NameBDBM50086676
Synonyms:CHEMBL3426304
TypeSmall organic molecule
Emp. Form.C25H31N5O3S
Mol. Mass.481.61
SMILESCC1(C)CCc2c(C1)[nH]nc2C(=O)Nc1cnn(c1)[C@@H](C1CCS(=O)(=O)CC1)c1ccccc1