Reaction Details
TargetTyrosine-protein kinase Lck
LigandBDBM50086681
Substrate/Competitorn/a
Meas. Tech.ChEMBL_1477116 (CHEMBL3428283)
Ki 460±n/a nM
Citation Burch, JDBarrett, KChen, YDeVoss, JEigenbrot, CGoldsmith, RIsmaili, MHLau, KLin, ZOrtwine, DFZarrin, AAMcEwan, PABarker, JJEllebrandt, CKordt, DStein, DBWang, XChen, YHu, BXu, XYuen, PWZhang, YPei, Z Tetrahydroindazoles as Interleukin-2 Inducible T-Cell Kinase Inhibitors. Part II. Second-Generation Analogues with Enhanced Potency, Selectivity, and Pharmacodynamic Modulation in Vivo. J Med Chem58:3806-16 (2015) 
 
Tyrosine-protein kinase Lck
Name:Tyrosine-protein kinase Lck
Type:n/a
Mol. Mass.:57987.83
Organism:Homo sapiens (Human)
Description:P06239
Residue:509
BDBM50086681
NameBDBM50086681
Synonyms:CHEMBL3426309
TypeSmall organic molecule
Emp. Form.C25H27F2N5O3S
Mol. Mass.515.575
SMILES[H][C@]12Cc3c(C[C@@]1(C)C2(F)F)[nH]nc3C(=O)Nc1cnn(c1)[C@H](c1ccccc1)[C@@]1([H])CCCCS1(=O)=O