Reaction Details
TargetCytochrome P450 3A4
LigandBDBM50088503
Substrate/Competitorn/a
Meas. Tech.ChEMBL_1487664 (CHEMBL3532650)
IC50 300±n/a nM
Citation Walsky, RLObach, RSHyland, RKang, PZhou, SWest, MGeoghegan, KFHelal, CJWalker, GSGoosen, TCZientek, MA Selective mechanism-based inactivation of CYP3A4 by CYP3cide (PF-04981517) and its utility as an in vitro tool for delineating the relative roles of CYP3A4 versus CYP3A5 in the metabolism of drugs. Drug Metab Dispos40:1686-97 (2012) 
 
Cytochrome P450 3A4
Name:Cytochrome P450 3A4
Type:Enzyme
Mol. Mass.:57349.57
Organism:Homo sapiens (Human)
Description:n/a
Residue:503
BDBM50088503
NameBDBM50088503
Synonyms:CHEMBL3527048
TypeSmall organic molecule
Emp. Form.C26H32N8
Mol. Mass.456.5859
SMILESCc1ccc(cc1)-c1c(cnn1C)-c1nn(C)c2ncnc(N3CC[C@@H](C3)N3CCCCC3)c12