Reaction Details
TargetSerine/threonine-protein kinase mTOR
LigandBDBM92862
Substrate/Competitorn/a
Meas. Tech.ChEMBL_1496313 (CHEMBL3579762)
IC50 12±n/a nM
Citation Han, FLin, SLiu, PLiu, XTao, JDeng, XYi, CXu, H Discovery of a Novel Series of Thienopyrimidine as Highly Potent and Selective PI3K Inhibitors. ACS Med Chem Lett6:434-8 (2015) 
 
Serine/threonine-protein kinase mTOR
Name:Serine/threonine-protein kinase mTOR
Type:Rapamycin target protein
Mol. Mass.:288917.12
Organism:Homo sapiens (Human)
Description:P42345
Residue:2549
BDBM92862
NameBDBM92862
Synonyms:US9284315, BEZ-235 | mTOR Inhibitor, BEZ235
TypeSmall molecule
Emp. Form.C30H23N5O
Mol. Mass.469.5365
SMILESCn1c2cnc3ccc(cc3c2n(-c2ccc(cc2)C(C)(C)C#N)c1=O)-c1cnc2ccccc2c1