Reaction Details
TargetSerine/threonine-protein kinase mTOR
LigandBDBM50089321
Substrate/Competitorn/a
Meas. Tech.ChEMBL_1496313 (CHEMBL3579762)
IC50 0.750000±n/a nM
Citation Han, FLin, SLiu, PLiu, XTao, JDeng, XYi, CXu, H Discovery of a Novel Series of Thienopyrimidine as Highly Potent and Selective PI3K Inhibitors. ACS Med Chem Lett6:434-8 (2015) 
 
Serine/threonine-protein kinase mTOR
Name:Serine/threonine-protein kinase mTOR
Type:Rapamycin target protein
Mol. Mass.:288917.12
Organism:Homo sapiens (Human)
Description:P42345
Residue:2549
BDBM50089321
NameBDBM50089321
Synonyms:CHEMBL3577908
TypeSmall organic molecule
Emp. Form.C26H18F2N4O3S
Mol. Mass.504.508
SMILESCOc1ncc(cc1NS(=O)(=O)c1ccc(F)cc1F)-c1ccc2nccc(-c3ccncc3)c2c1