Reaction Details
TargetPoly [ADP-ribose] polymerase 1
LigandBDBM50089867
Substrate/Competitorn/a
Meas. Tech.ChEMBL_1496978 (CHEMBL3579452)
IC50 110±n/a nM
Citation Samain, FEkblad, TMikutis, GZhong, NZimmermann, MNauer, ABajic, DDecurtins, WScheuermann, JBrown, PJHall, JGräslund, SSchüler, HNeri, DFranzini, RM Tankyrase 1 Inhibitors with Drug-like Properties Identified by Screening a DNA-Encoded Chemical Library. J Med Chem58:5143-9 (2015) 
 
Poly [ADP-ribose] polymerase 1
Name:Poly [ADP-ribose] polymerase 1
Type:n/a
Mol. Mass.:113114.22
Organism:Homo sapiens (Human)
Description:P09874
Residue:1014
BDBM50089867
NameBDBM50089867
Synonyms:CHEMBL3577626
TypeSmall organic molecule
Emp. Form.C19H17Cl2N3O3
Mol. Mass.406.263
SMILESClc1ccc(CCNC(=O)c2ccccc2N2CCC(=O)NC2=O)c(Cl)c1