Reaction Details
TargetPoly [ADP-ribose] polymerase 1
LigandBDBM50089863
Substrate/Competitorn/a
Meas. Tech.ChEMBL_1496978 (CHEMBL3579452)
IC50 41±n/a nM
Citation Samain, FEkblad, TMikutis, GZhong, NZimmermann, MNauer, ABajic, DDecurtins, WScheuermann, JBrown, PJHall, JGräslund, SSchüler, HNeri, DFranzini, RM Tankyrase 1 Inhibitors with Drug-like Properties Identified by Screening a DNA-Encoded Chemical Library. J Med Chem58:5143-9 (2015) 
 
Poly [ADP-ribose] polymerase 1
Name:Poly [ADP-ribose] polymerase 1
Type:n/a
Mol. Mass.:113114.22
Organism:Homo sapiens (Human)
Description:P09874
Residue:1014
BDBM50089863
NameBDBM50089863
Synonyms:CHEMBL3577701
TypeSmall organic molecule
Emp. Form.C25H26N4O6
Mol. Mass.478.4971
SMILESCOc1ccc2C(=O)CC(CC(=O)NCCNC(=O)c3ccccc3N3CCC(=O)NC3=O)c2c1