Reaction Details
TargetTyrosyl-DNA phosphodiesterase 1
LigandBDBM50090917
Substrate/Competitorn/a
Meas. Tech.ChEMBL_1499159 (CHEMBL3585165)
IC50>111000±n/a nM
Citation Beck, DEAbdelmalak, MLv, WReddy, PVTender, GSO'Neill, EAgama, KMarchand, CPommier, YCushman, M Discovery of potent indenoisoquinoline topoisomerase I poisons lacking the 3-nitro toxicophore. J Med Chem58:3997-4015 (2015) 
 
Tyrosyl-DNA phosphodiesterase 1
Name:Tyrosyl-DNA phosphodiesterase 1
Type:Enzyme
Mol. Mass.:68430.66
Organism:Homo sapiens (Human)
Description:Q9NUW8
Residue:608
BDBM50090917
NameBDBM50090917
Synonyms:CHEMBL3581863
TypeSmall organic molecule
Emp. Form.C19H14INO4
Mol. Mass.447.2232
SMILESOC[C@@H](O)Cn1c2-c3ccccc3C(=O)c2c2ccc(I)cc2c1=O