Reaction Details
TargetTyrosyl-DNA phosphodiesterase 1
LigandBDBM50388544
Substrate/Competitorn/a
Meas. Tech.ChEMBL_1499159 (CHEMBL3585165)
IC50 12000±n/a nM
Citation Beck, DEAbdelmalak, MLv, WReddy, PVTender, GSO'Neill, EAgama, KMarchand, CPommier, YCushman, M Discovery of potent indenoisoquinoline topoisomerase I poisons lacking the 3-nitro toxicophore. J Med Chem58:3997-4015 (2015) 
 
Tyrosyl-DNA phosphodiesterase 1
Name:Tyrosyl-DNA phosphodiesterase 1
Type:Enzyme
Mol. Mass.:68430.66
Organism:Homo sapiens (Human)
Description:Q9NUW8
Residue:608
BDBM50388544
NameBDBM50388544
Synonyms:CHEMBL2057323
TypeSmall organic molecule
Emp. Form.C41H36N4O4
Mol. Mass.648.7489
SMILESO=C1c2ccccc2-c2c1c1ccccc1c(=O)n2CCCNCCCNCCCn1c2-c3ccccc3C(=O)c2c2ccccc2c1=O