Reaction Details
TargetTyrosyl-DNA phosphodiesterase 2
LigandBDBM50090917
Substrate/Competitorn/a
Meas. Tech.ChEMBL_1499160 (CHEMBL3585166)
IC50>111000±n/a nM
Citation Beck, DEAbdelmalak, MLv, WReddy, PVTender, GSO'Neill, EAgama, KMarchand, CPommier, YCushman, M Discovery of potent indenoisoquinoline topoisomerase I poisons lacking the 3-nitro toxicophore. J Med Chem58:3997-4015 (2015) 
 
Tyrosyl-DNA phosphodiesterase 2
Name:Tyrosyl-DNA phosphodiesterase 2
Type:Enzyme Catalytic Domain
Mol. Mass.:40916.54
Organism:Homo sapiens (Human)
Description:gi_23510348
Residue:362
BDBM50090917
NameBDBM50090917
Synonyms:CHEMBL3581863
TypeSmall organic molecule
Emp. Form.C19H14INO4
Mol. Mass.447.2232
SMILESOC[C@@H](O)Cn1c2-c3ccccc3C(=O)c2c2ccc(I)cc2c1=O