Reaction Details
TargetTyrosyl-DNA phosphodiesterase 2
LigandBDBM50090918
Substrate/Competitorn/a
Meas. Tech.ChEMBL_1499160 (CHEMBL3585166)
IC50 37000±n/a nM
Citation Beck, DEAbdelmalak, MLv, WReddy, PVTender, GSO'Neill, EAgama, KMarchand, CPommier, YCushman, M Discovery of potent indenoisoquinoline topoisomerase I poisons lacking the 3-nitro toxicophore. J Med Chem58:3997-4015 (2015) 
 
Tyrosyl-DNA phosphodiesterase 2
Name:Tyrosyl-DNA phosphodiesterase 2
Type:Enzyme Catalytic Domain
Mol. Mass.:40916.54
Organism:Homo sapiens (Human)
Description:gi_23510348
Residue:362
BDBM50090918
NameBDBM50090918
Synonyms:CHEMBL3581877
TypeSmall organic molecule
Emp. Form.C20H19N3O2
Mol. Mass.333.3838
SMILESCN(C)CCCn1c2-c3ccccc3C(=O)c2c2ccncc2c1=O