Reaction Details
TargetFKBP12A/mTOR
LigandBDBM50092779
Substrate/Competitorn/a
Meas. Tech.ChEMBL_1501625 (CHEMBL3587377)
IC50 650±n/a nM
Citation Mortensen, DSPerrin-Ninkovic, SMShevlin, GZhao, JPackard, GBahmanyar, SCorrea, MElsner, JHarris, RLee, BGPapa, PParnes, JSRiggs, JRSapienza, JTehrani, LWhitefield, BApuy, JBisonette, RRGamez, JCHickman, MKhambatta, GLeisten, JPeng, SXRichardson, SJCathers, BECanan, SSMoghaddam, MFRaymon, HKWorland, PNarla, RKFultz, KESankar, S Discovery of mammalian target of rapamycin (mTOR) kinase inhibitor CC-223. J Med Chem58:5323-33 (2015) 
 
FKBP12A/mTOR
Name:FKBP12A/mTOR
Type:n/a
Mol. Mass.:n/a
Description:ASSAY_ID of ChEMBL is 2232618
Components:This complex has 2 components.
Component 1
Name:Peptidyl-prolyl cis-trans isomerase FKBP1A
Synonyms:12 kDa FK506-binding protein FK506-binding protein 1A FKB1A_HUMAN FKBP-1A FKBP12 Immunophilin FKBP12 PPIase FKBP1A Rotamase mTOR/FKBP12A/FKBP12B
Type:Isomerase
Mol. Mass.:11953.09
Organism:Homo sapiens (Human)
Description:P62942
Residue:108
Component 2
Name:Serine/threonine-protein kinase mTOR
Synonyms:FK506-binding protein 12-rapamycin complex-associated protein 1 FRAP FRAP1 MTOR Mammalian Target of Rapamycin (mTOR) RAFT1 Rapamycin and FKBP12 target 1 Serine/threonine-protein kinase (mTOR) | mTORC2
Type:Rapamycin target protein
Mol. Mass.:288917.12
Organism:Homo sapiens (Human)
Description:P42345
Residue:2549
BDBM50092779
NameBDBM50092779
Synonyms:CHEMBL3586391
TypeSmall organic molecule
Emp. Form.C17H21N5O3
Mol. Mass.343.3803
SMILESCOCCN1C(=O)CNc2ncc(nc12)-c1ccc(nc1)C(C)(C)O