Reaction Details
TargetOrexin receptor type 2
LigandBDBM50097380
Substrate/Competitorn/a
Meas. Tech.ChEMBL_1501663 (CHEMBL3587482)
Ki 12±n/a nM
Citation Letavic, MABonaventure, PCarruthers, NIDugovic, CKoudriakova, TLord, BLovenberg, TWLy, KSMani, NSNepomuceno, DPippel, DJRizzolio, MShelton, JEShah, CRShireman, BTYoung, LKYun, S Novel Octahydropyrrolo[3,4-c]pyrroles Are Selective Orexin-2 Antagonists: SAR Leading to a Clinical Candidate. J Med Chem58:5620-36 (2015) 
 
Orexin receptor type 2
Name:Orexin receptor type 2
Type:Protein
Mol. Mass.:50710.53
Organism:Homo sapiens (Human)
Description:O43614
Residue:444
BDBM50097380
NameBDBM50097380
Synonyms:CHEMBL3586432
TypeSmall organic molecule
Emp. Form.C21H23N7O
Mol. Mass.389.4536
SMILES[H][C@@]12CN(C[C@]1([H])CN(C2)c1nc(C)cc(C)n1)C(=O)c1ccccc1-n1nccn1