Reaction Details
TargetOrexin receptor type 2
LigandBDBM50097360
Substrate/Competitorn/a
Meas. Tech.ChEMBL_1501723 (CHEMBL3587703)
Ki 12±n/a nM
Citation Letavic, MABonaventure, PCarruthers, NIDugovic, CKoudriakova, TLord, BLovenberg, TWLy, KSMani, NSNepomuceno, DPippel, DJRizzolio, MShelton, JEShah, CRShireman, BTYoung, LKYun, S Novel Octahydropyrrolo[3,4-c]pyrroles Are Selective Orexin-2 Antagonists: SAR Leading to a Clinical Candidate. J Med Chem58:5620-36 (2015) 
 
Orexin receptor type 2
Name:Orexin receptor type 2
Type:Protein
Mol. Mass.:52508.46
Organism:Rattus norvegicus (Rat)
Description:P56719
Residue:460
BDBM50097360
NameBDBM50097360
Synonyms:CHEMBL3586440
TypeSmall organic molecule
Emp. Form.C22H25N7O
Mol. Mass.403.4802
SMILES[H][C@@]12CN(C[C@]1([H])CN(C2)c1nc(C)cc(C)n1)C(=O)c1c(C)cccc1-n1nccn1