Reaction Details
TargetFKBP12A/mTOR
LigandBDBM50092782
Substrate/Competitorn/a
Meas. Tech.ChEMBL_1500546 (CHEMBL3587522)
IC50 8.0±n/a nM
Citation Mortensen, DSPerrin-Ninkovic, SMShevlin, GElsner, JZhao, JWhitefield, BTehrani, LSapienza, JRiggs, JRParnes, JSPapa, PPackard, GLee, BGHarris, RCorrea, MBahmanyar, SRichardson, SJPeng, SXLeisten, JKhambatta, GHickman, MGamez, JCBisonette, RRApuy, JCathers, BECanan, SSMoghaddam, MFRaymon, HKWorland, PNarla, RKFultz, KESankar, S Optimization of a Series of Triazole Containing Mammalian Target of Rapamycin (mTOR) Kinase Inhibitors and the Discovery of CC-115. J Med Chem58:5599-608 (2015) 
 
FKBP12A/mTOR
Name:FKBP12A/mTOR
Type:n/a
Mol. Mass.:n/a
Description:ASSAY_ID of ChEMBL is 2232618
Components:This complex has 2 components.
Component 1
Name:Peptidyl-prolyl cis-trans isomerase FKBP1A
Synonyms:12 kDa FK506-binding protein FK506-binding protein 1A FKB1A_HUMAN FKBP-1A FKBP12 Immunophilin FKBP12 PPIase FKBP1A Rotamase mTOR/FKBP12A/FKBP12B
Type:Isomerase
Mol. Mass.:11953.09
Organism:Homo sapiens (Human)
Description:P62942
Residue:108
Component 2
Name:Serine/threonine-protein kinase mTOR
Synonyms:FK506-binding protein 12-rapamycin complex-associated protein 1 FRAP FRAP1 MTOR Mammalian Target of Rapamycin (mTOR) RAFT1 Rapamycin and FKBP12 target 1 Serine/threonine-protein kinase (mTOR) | mTORC2
Type:Rapamycin target protein
Mol. Mass.:288917.12
Organism:Homo sapiens (Human)
Description:P42345
Residue:2549
BDBM50092782
NameBDBM50092782
Synonyms:CHEMBL3586387
TypeSmall organic molecule
Emp. Form.C21H24N8O2
Mol. Mass.420.4677
SMILESCc1nc(ccc1-c1cnc2NCC(=O)N(CCC3CCOCC3)c2n1)-c1nc[nH]n1