Reaction Details
TargetTyrosine-protein kinase JAK2
LigandBDBM50094616
Substrate/Competitorn/a
Meas. Tech.ChEMBL_1504396 (CHEMBL3592849)
IC50 2.1±n/a nM
Citation Zimmermann, KSang, XMastalerz, HAJohnson, WLZhang, GLiu, QBatt, DLombardo, LJVyas, DTrainor, GLTokarski, JSLorenzi, MVYou, DGottardis, MMLippy, JKhan, JSack, JSPurandare, AV 9H-Carbazole-1-carboxamides as potent and selective JAK2 inhibitors. Bioorg Med Chem Lett25:2809-12 (2015) 
 
Tyrosine-protein kinase JAK2
Name:Tyrosine-protein kinase JAK2
Type:Protein
Mol. Mass.:130684.68
Organism:Homo sapiens (Human)
Description:O60674
Residue:1132
BDBM50094616
NameBDBM50094616
Synonyms:CHEMBL3589325
TypeSmall organic molecule
Emp. Form.C24H24N4O
Mol. Mass.384.4736
SMILESCN1CCN(CC1)c1ccc2c(c1)[nH]c1c(cc(cc21)-c1ccccc1)C(N)=O