Reaction Details
TargetLysine-specific demethylase 4C
LigandBDBM26106
Substrate/Competitorn/a
Meas. Tech.ChEMBL_1504145 (CHEMBL3591677)
IC50 430000±n/a nM
Citation Itoh, YSawada, HSuzuki, MTojo, TSasaki, RHasegawa, MMizukami, TSuzuki, T Identification of Jumonji AT-Rich Interactive Domain 1A Inhibitors and Their Effect on Cancer Cells. ACS Med Chem Lett6:665-70 (2015) 
 
Lysine-specific demethylase 4C
Name:Lysine-specific demethylase 4C
Type:Protein
Mol. Mass.:119979.01
Organism:Homo sapiens (Human)
Description:Q9H3R0
Residue:1056
BDBM26106
NameBDBM26106
Synonyms:CHEMBL90852 NOG [(carboxymethyl)carbamoyl]formic acid
TypeSmall organic molecule
Emp. Form.C4H5NO5
Mol. Mass.147.0862
SMILESOC(=O)CNC(=O)C(O)=O