Reaction Details
TargetLysine-specific demethylase 3A
LigandBDBM50095451
Substrate/Competitorn/a
Meas. Tech.ChEMBL_1504146 (CHEMBL3591678)
IC50>100000±n/a nM
Citation Itoh, YSawada, HSuzuki, MTojo, TSasaki, RHasegawa, MMizukami, TSuzuki, T Identification of Jumonji AT-Rich Interactive Domain 1A Inhibitors and Their Effect on Cancer Cells. ACS Med Chem Lett6:665-70 (2015) 
 
Lysine-specific demethylase 3A
Name:Lysine-specific demethylase 3A
Type:PROTEIN
Mol. Mass.:147368.22
Organism:Homo sapiens (Human)
Description:Q9Y4C1
Residue:1321
BDBM50095451
NameBDBM50095451
Synonyms:CHEMBL3590431
TypeSmall organic molecule
Emp. Form.C20H40N2O4
Mol. Mass.372.5426
SMILESCCCCCCCCN(CCCC)CCCCC(=O)N(O)CCC(O)=O