Reaction Details
TargetReceptor-type tyrosine-protein kinase FLT3
LigandBDBM50095991
Substrate/Competitorn/a
Meas. Tech.ChEMBL_1505556 (CHEMBL3595707)
IC50 10.0±n/a nM
Citation Chen, CTHsu, JTLin, WHLu, CTYen, SCHsu, THuang, YLSong, JSChen, CHChou, LHYen, KJChen, CPKuo, PCHuang, CLLiu, HEChao, YSYeh, TKJiaang, WT Identification of a potent 5-phenyl-thiazol-2-ylamine-based inhibitor of FLT3 with activity against drug resistance-conferring point mutations. Eur J Med Chem100:151-61 (2015) 
 
Receptor-type tyrosine-protein kinase FLT3
Name:Receptor-type tyrosine-protein kinase FLT3
Type:Enzyme
Mol. Mass.:112888.62
Organism:Homo sapiens (Human)
Description:P36888
Residue:993
BDBM50095991
NameBDBM50095991
Synonyms:CHEMBL3593290
TypeSmall organic molecule
Emp. Form.C26H31N9O2S
Mol. Mass.533.648
SMILESCCN1CCN(CC1)c1cc(Nc2ncc(s2)-c2ccc(NC(=O)Nc3cc(CC)on3)cc2)nc(C)n1