Reaction Details
TargetVascular endothelial growth factor receptor 2
LigandBDBM50096117
Substrate/Competitorn/a
Meas. Tech.ChEMBL_1505364 (CHEMBL3595190)
IC50 120±n/a nM
Citation Chen, CTHsu, JTLin, WHLu, CTYen, SCHsu, THuang, YLSong, JSChen, CHChou, LHYen, KJChen, CPKuo, PCHuang, CLLiu, HEChao, YSYeh, TKJiaang, WT Identification of a potent 5-phenyl-thiazol-2-ylamine-based inhibitor of FLT3 with activity against drug resistance-conferring point mutations. Eur J Med Chem100:151-61 (2015) 
 
Vascular endothelial growth factor receptor 2
Name:Vascular endothelial growth factor receptor 2
Type:Receptor Tyrosine Kinase
Mol. Mass.:151510.97
Organism:Homo sapiens (Human)
Description:P35968
Residue:1356
BDBM50096117
NameBDBM50096117
Synonyms:CHEMBL3593294
TypeSmall organic molecule
Emp. Form.C28H31N7O2S
Mol. Mass.529.656
SMILESCCN1CCN(CC1)c1cc(Nc2ncc(s2)-c2ccc(NC(=O)OCc3ccccc3)cc2)nc(C)n1