Reaction Details
TargetVascular endothelial growth factor receptor 2
LigandBDBM50096125
Substrate/Competitorn/a
Meas. Tech.ChEMBL_1505364 (CHEMBL3595190)
IC50 43±n/a nM
Citation Chen, CTHsu, JTLin, WHLu, CTYen, SCHsu, THuang, YLSong, JSChen, CHChou, LHYen, KJChen, CPKuo, PCHuang, CLLiu, HEChao, YSYeh, TKJiaang, WT Identification of a potent 5-phenyl-thiazol-2-ylamine-based inhibitor of FLT3 with activity against drug resistance-conferring point mutations. Eur J Med Chem100:151-61 (2015) 
 
Vascular endothelial growth factor receptor 2
Name:Vascular endothelial growth factor receptor 2
Type:Receptor Tyrosine Kinase
Mol. Mass.:151510.97
Organism:Homo sapiens (Human)
Description:P35968
Residue:1356
BDBM50096125
NameBDBM50096125
Synonyms:CHEMBL3593285
TypeSmall organic molecule
Emp. Form.C27H29ClN8OS
Mol. Mass.549.09
SMILESCCN1CCN(CC1)c1cc(Nc2ncc(s2)-c2ccc(NC(=O)Nc3ccc(Cl)cc3)cc2)nc(C)n1